Target
Insulin-degrading enzyme
Ligand
BDBM209043
Substrate
Meas. Tech.
IDE Activity Assay
IC50
5e+2±n/a nM
Citation
 Liu, DRMaianti, JPSaghatelian, AKleiner, RE Macrocyclic insulin-degrading enzyme (IDE) inhibitors and uses thereof US Patent  US9243038 Publication Date 1/26/2016 
Target
Name:
Insulin-degrading enzyme
Synonyms:
Abeta-degrading protease IDE Insulin degrading enzyme (hIDE) Insulin-degrading enzyme Insulysin | insulin-degrading enzyme isoform 1 precursor
Type:
Enzyme Catalytic Domain
Mol. Mass.:
117968.59
Organism:
Homo sapiens (Human)
Description:
P14735
Residue:
1019
  
Inhibitor
Name:
BDBM209043
Synonyms:
US9243038, 17
Type:
Small organic molecule
Emp. Form.:
C37H46N6O7
Mol. Mass.:
686.7971
SMILES:
NC(=O)C1CCCCNC(=O)[C@@H](Cc2ccc(cc2)C(=O)c2ccccc2)NC(=O)[C@H](CC2CCCCC2)NC(=O)CNC(=O)\C=C\C(=O)N1
: