Target
Bcl-2-like protein 1
Ligand
BDBM209199
Substrate
Meas. Tech.
FL5.12 Cellular Assay
EC50
0.2±n/a nM
Citation
 Wang, LDoherty, GWang, XTao, ZBruncko, MKunzer, ARWendt, MDSong, XFrey, RHansen, TMSullivan, GMJudd, ASouers, A Apoptosis-inducing agents for the treatment of cancer and immune and autoimmune diseases US Patent  US9266877 Publication Date 2/23/2016 
Target
Name:
Bcl-2-like protein 1
Synonyms:
Apoptosis regulator Bcl-XL Bcl2l Bclx
Type:
Protein
Mol. Mass.:
26122.63
Organism:
Mus musculus (Mouse)
Description:
Q64373
Residue:
233
  
Inhibitor
Name:
BDBM209199
Synonyms:
US9266877, 145
Type:
Small organic molecule
Emp. Form.:
C40H45N7O4S
Mol. Mass.:
719.895
SMILES:
Cc1c(cnn1CC1(CCCC(C)(C)C1)N1CCOCC1)-c1ccc(nc1C(O)=O)N1CCc2cccc(C(=O)Nc3nc4ccccc4s3)c2C1
: