Target
Fibroblast growth factor receptor 4 [388-802]
Ligand
BDBM209368
Substrate
Meas. Tech.
Biochemical Kinase Assay
pH
7.5±n/a
Temperature
303.15±n/a K
IC50
0.6±n/a nM
Comments
extracted
Citation
 Buschmann, NFairhurst, RAFuret, PKnöpfel, TLeblanc, CLiao, LMah, RNimsgern, PRipoche, SXiong, JHan, BWang, CZhao, X Ring-fused bicyclic pyridyl derivatives as FGFR4 inhibitors US Patent  US9266883 Publication Date 2/23/2016 
Target
Name:
Fibroblast growth factor receptor 4 [388-802]
Synonyms:
FGFR4 Fibroblast growth factor receptor 4 (FGFR4) TKF
Type:
Protein
Mol. Mass.:
45529.19
Organism:
Homo sapiens (Human)
Description:
GST-FGFR4(388-802)
Residue:
415
  
Inhibitor
Name:
BDBM209368
Synonyms:
US9266883, 228
Type:
Small organic molecule
Emp. Form.:
C26H32N8O4
Mol. Mass.:
520.5835
SMILES:
COCCNc1cc(NC(=O)N2[C@@H](C)CCc3cc(CN4CCN(C)CC4=O)c(C=O)nc23)ncc1C#N
: