Target
Bromodomain-containing protein 4 [44-168]/Histone H4
Ligand
BDBM209485
Substrate
Meas. Tech.
AlphaScreen Assay
IC50
5±n/a nM
Citation
 Engelhardt, HGianni, DSmethurst, C Substituted [1,2,4]triazolo[4,3-A]pyrazines that are BRD4 inhibitors US Patent  US9266891 Publication Date 2/23/2016 
Target
Name:
Bromodomain-containing protein 4 [44-168]/Histone H4
Synonyms:
BRD4-BD1 and Histone H4
Type:
Protein
Mol. Mass.:
Description:
Components:
This complex has 2 components.
Component 1
Name:
Bromodomain-containing protein 4 [44-168]
Synonyms:
BET bromodomain 4(1) (BRD4(1)) BRD4-BD1 protein (aa 44-168) Bromodomain protein 4 (BRD4-BD1) Bromodomain-containing protein 4 (BRD4) (aa 44-168) Bromodomain-containing protein 4 bromodomain 1 (BRD4-BD1) | HUNK1
Type:
Enzyme Catalytic Domain
Mol. Mass.:
14866.49
Organism:
Homo sapiens (Human)
Description:
aa (44-168)
Residue:
125
  
Component 2
Name:
Histone H4
Synonyms:
H4-16 H4/B H4/D H4/G H4/I H4/K H4/N H4C1 H4FA H4FC H4FE H4FH H4FJ H4FM H4FO HIST1H4A HIST1H4C HIST1H4E HIST1H4H HIST1H4J HIST1H4L HIST2H4A HIST4H4 andH4/B andH4/D andH4/G andH4/I andH4/K andH4/N | andH4/O
Type:
Protein
Mol. Mass.:
11386.36
Organism:
Homo sapiens (Human)
Description:
P62805
Residue:
103
  
Inhibitor
Name:
BDBM209485
Synonyms:
US10328074, Example III-26 US9266891, III-26
Type:
Small organic molecule
Emp. Form.:
C26H29N9O
Mol. Mass.:
483.5682
SMILES:
CC(C)Nc1nc(cn2c(C)nnc12)-c1nc2ccc(cc2n1Cc1ccccn1)N1CCOCC1
: