Target
Ectonucleotide pyrophosphatase/phosphodiesterase family member 2
Ligand
BDBM209591
Substrate
BDBM209594
Meas. Tech.
FS-3 Assay
Temperature
310.15±n/a K
IC50
357±n/a nM
Comments
extracted
Citation
 Gibson, KROwen, DR Substituted pyridazines for the treatment of pain US Patent  US9273011 Publication Date 3/1/2016 
Target
Name:
Ectonucleotide pyrophosphatase/phosphodiesterase family member 2
Synonyms:
ATX Autotaxin (ATX) ENPP2 Ectonucleotide Pyrophosphatase/Phosphodiesterase 2 (ENPP2) Extracellular lysophospholipase D PDNP2
Type:
Enzyme
Mol. Mass.:
99007.13
Organism:
Homo sapiens (Human)
Description:
Q13822
Residue:
863
  
Inhibitor
Name:
BDBM209591
Synonyms:
US10016420, 12 | US9273011, 12
Type:
Small organic molecule
Emp. Form.:
C21H24N6O2
Mol. Mass.:
392.4543
SMILES:
Cc1noc(NC(=O)c2ccc(NC3CCN(Cc4ccccc4)C3)nn2)c1C
:
Substrate
Name:
BDBM209594
Synonyms:
US9273011, FS-3 Lysophosphodiesterase (lysoPLD)
Type:
Substrate
Emp. Form.:
C57H67N6O19P
Mol. Mass.:
1171.1444
SMILES:
CN(C)c1ccc(cc1)\N=N\c1ccc(cc1)C(=O)NCCCCCC(=O)O[C@H](O)COP(O)(=O)OCCNC(=O)CCOCCOCCOCCOCCNC(=O)c1ccc(c(c1)C(O)=O)-c1c2ccc(O)cc2oc2cc(=O)ccc12
: