Target
Neurogenic locus notch homolog protein 1
Ligand
BDBM209877
Substrate
Meas. Tech.
Biological Assay
IC50
7.2±n/a nM
Citation
 Gavai, AVDeLucca, GVO'Malley, DGill, PQuesnelle, CAFink, BEZhao, YLee, FY Bis(fluoroalkyl)-1,4-benzodiazepinone compounds and prodrugs thereof US Patent  US9273014 Publication Date 3/1/2016 
Target
Name:
Neurogenic locus notch homolog protein 1
Synonyms:
NEXT NOTC1_HUMAN Neurogenic locus notch homolog protein 1 Notch 1 Notch 1 intracellular domain TAN1 hN1
Type:
Enzyme
Mol. Mass.:
272417.95
Organism:
Homo sapiens (Human)
Description:
P46531
Residue:
2555
  
Inhibitor
Name:
BDBM209877
Synonyms:
US9273014, 6
Type:
Small organic molecule
Emp. Form.:
C28H30F6N4O3
Mol. Mass.:
584.5532
SMILES:
CCc1cccc2c1NC(=O)[C@@H](NC(=O)[C@H](CCC(F)(F)F)[C@H](CCC(F)(F)F)C(N)=O)N=C2c1cccc(C)c1
: