Target
Neurogenic locus notch homolog protein 3
Ligand
BDBM209894
Substrate
Meas. Tech.
Biological Assay
IC50
8.3±n/a nM
Citation
 Gavai, AVDeLucca, GVO'Malley, DGill, PQuesnelle, CAFink, BEZhao, YLee, FY Bis(fluoroalkyl)-1,4-benzodiazepinone compounds and prodrugs thereof US Patent  US9273014 Publication Date 3/1/2016 
Target
Name:
Neurogenic locus notch homolog protein 3
Synonyms:
NOTC3_HUMAN Neurogenic locus notch homolog protein 3 Notch 3 Notch 3 intracellular domain | Notch 3 intracellular domain (Notch 3)
Type:
Enzyyme
Mol. Mass.:
243579.59
Organism:
Homo sapiens (Human)
Description:
Q9UM47
Residue:
2321
  
Inhibitor
Name:
BDBM209894
Synonyms:
US9273014, 23
Type:
Small organic molecule
Emp. Form.:
C26H26F6N4O3
Mol. Mass.:
556.5001
SMILES:
Cc1cccc2c1NC(=O)[C@@H](NC(=O)[C@H](CCC(F)(F)F)[C@H](CCC(F)(F)F)C(N)=O)N=C2c1ccccc1
: