Target
Lysine-specific histone demethylase 1A
Ligand
BDBM283272
Substrate
Meas. Tech.
In Vitro Enzyme Inhibition Assay
Temperature
298.15±n/a K
IC50
<100±n/a nM
Comments
extracted
Citation
 Chen, YKKanouni, TKaldor, SWStafford, JAVeal, JM Inhibitors of lysine specific demethylase-1 US Patent  US9573930 Publication Date 2/21/2017 
Target
Name:
Lysine-specific histone demethylase 1A
Synonyms:
AOF2 Flavin-containing amine oxidase domain-containing protein 2 KDM1A KIAA0601 Lysine-specific demethylase 1 (LSD1) Lysine-specific histone demethylase 1 (LSD1)
Type:
Enzyme
Mol. Mass.:
92901.01
Organism:
Homo sapiens (Human)
Description:
O60341
Residue:
852
  
Inhibitor
Name:
BDBM283272
Synonyms:
2-fluoro-4-[5-(4-methoxy-phenyl)- 1-methyl-2-(methyl-piperidin-4-yl- amino)-6-oxo-1,6-dihydro-pyrimidin- 4-yl]-benzonitrile US10207999, Example 55 US10548896, Example 55 US10960005, Example 55 US9573930, Example 55 US9776974, Example 55
Type:
Small organic molecule
Emp. Form.:
C25H26FN5O2
Mol. Mass.:
447.5046
SMILES:
COc1ccc(cc1)-c1c(nc(N(C)C2CCNCC2)n(C)c1=O)-c1ccc(C#N)c(F)c1
: