Target
Beta-secretase 1
Ligand
BDBM209918
Substrate
Meas. Tech.
Cellular Aβ-Lowering Assay
Temperature
310.15±n/a K
IC50
0.0009±n/a nM
Comments
extracted
Citation
 Hilpert, HWoltering, T 5-amino[1,4]thiazines as BACE 1 inhibitors US Patent  US9273042 Publication Date 3/1/2016 
Target
Name:
Beta-secretase 1
Synonyms:
ASP2 Aspartyl protease 2 BACE1 Beta-secretase (BACE) Beta-secretase 1 (BACE 1) Beta-secretase 1 (BACE1) Beta-site amyloid precursor protein cleaving enzyme 1 Memapsin-2 beta-Secretase (BACE-1) | beta-Secretase (BACE1)
Type:
Protein
Mol. Mass.:
55755.10
Organism:
Homo sapiens (Human)
Description:
P56817
Residue:
501
  
Inhibitor
Name:
BDBM209918
Synonyms:
US9273042, 7 | US9556135, 17
Type:
Small organic molecule
Emp. Form.:
C19H22FN5O4S
Mol. Mass.:
435.472
SMILES:
COc1cnc(cn1)C(=O)Nc1ccc(F)c(c1)[C@]1(C)CS(=O)(=O)C(C)(C)C(N)=N1
: