Target
Vascular endothelial growth factor receptor 2
Ligand
BDBM5888
Substrate
poly-Glu-Ala-Tyr
Meas. Tech.
Homogeneous Time-resolved Fluorescence (HTRF) Assay
pH
7.4±n/a
Temperature
295.15±n/a K
IC50
2100±n/a nM
Citation
 Curtin, MLFrey, RRHeyman, HRSarris, KASteinman, DHHolmes, JHBousquet, PFCunha, GAMoskey, MDAhmed, AAPease, LJGlaser, KBStewart, KDDavidsen, SKMichaelides, MR Isoindolinone ureas: a novel class of KDR kinase inhibitors. Bioorg Med Chem Lett 14:4505-9 (2004)  
Target
Name:
Vascular endothelial growth factor receptor 2
Synonyms:
CD_antigen=CD309 Fetal liver kinase 1 (FLK-1) KDR Protein-tyrosine kinase receptor Flk-1 VEGFR-2 VEGFR2 Vascular Endothelial Growth Factor Receptor Kinase 2 Vascular endothelial growth factor receptor 2 (KDR) Vascular endothelial growth factor receptor 2 (VEGFR2) Vascular endothelial growth factor receptor-2 (VEGFR-2)
Type:
Receptor Tyrosine Kinase
Mol. Mass.:
151510.97
Organism:
Homo sapiens (Human)
Description:
P35968
Residue:
1356
  
Inhibitor
Name:
BDBM5888
Synonyms:
CHEMBL359795 isoindolinone analog 19
Type:
Small organic molecule
Emp. Form.:
C23H20N2O2
Mol. Mass.:
356.4171
SMILES:
Cc1cccc(NC(=O)Cc2ccc(cc2)-c2cccc3C(=O)NCc23)c1
:
Substrate
Name:
poly-Glu-Ala-Tyr
Synonyms:
poly-Glu-Ala-Tyr-biotin
Type:
Random Copolymer
Mol. Mass.:
358.43
Organism:
Description:
It is a synthetic polymer of glutamic acid, alanine and tyrosine (poly-Glu-Ala-Tyr) that has been biotinylated.
Residue:
3
NA