Target
Dihydrofolate reductase type 1 from Tn4003
Ligand
BDBM210929
Substrate
Meas. Tech.
DHFR Inhibition Assay
IC50
4.1e+2± 1e+1 nM
Citation
 Reeve, SMScocchera, EWG-Dayanadan, NKeshipeddy, SKrucinska, JHajian, BFerreira, JNailor, MAeschlimann, JWright, DLAnderson, AC MRSA Isolates from United States Hospitals Carry dfrG and dfrK Resistance Genes and Succumb to Propargyl-Linked Antifolates. Cell Chem Biol 23:1458-1467 (2016)  
Target
Name:
Dihydrofolate reductase type 1 from Tn4003
Synonyms:
DYRA_STAAU dfrA
Type:
Protein
Mol. Mass.:
18461.80
Organism:
Staphylococcus aureus
Description:
P13955
Residue:
161
  
Inhibitor
Name:
BDBM210929
Synonyms:
UCP1172
Type:
Small organic molecule
Emp. Form.:
C24H24N4O3
Mol. Mass.:
416.4724
SMILES:
CCc1nc(N)nc(N)c1C#C[C@@H](C)c1cc(OC)cc(c1)-c1ccc(cc1)C(O)=O
: