Target
RAF proto-oncogene serine/threonine-protein kinase
Ligand
BDBM210021
Substrate
Meas. Tech.
Raf IC50 Assay
Temperature
298.15±n/a K
IC50
<0.25±n/a nM
Comments
extracted
Citation
 Zhou, CWang, SZhang, G Fused tricyclic compounds as Raf kinase inhibitors US Patent  US9273046 Publication Date 3/1/2016 
Target
Name:
RAF proto-oncogene serine/threonine-protein kinase
Synonyms:
C-Raf Protein Kinase RAF RAF1 Raf-1 Serine/threonine-protein kinase C-Raf | cRaf
Type:
Serine/threonine-protein kinase
Mol. Mass.:
73082.52
Organism:
Homo sapiens (Human)
Description:
P04049
Residue:
648
  
Inhibitor
Name:
BDBM210021
Synonyms:
US10576087, Compound 2.27 US9895376, Compound 2.27
Type:
Small organic molecule
Emp. Form.:
C24H18N4O4
Mol. Mass.:
426.4241
SMILES:
Oc1ccc2nc([nH]c2c1)C1C2Oc3ccc(Oc4ccnc5NC(=O)CCc45)cc3C12
: