Target
D-amino-acid oxidase
Ligand
BDBM210789
Substrate
Meas. Tech.
In Vitro DAAO Enzyme Assay
pH
7.4±n/a
Temperature
298.15±n/a K
IC50
6±n/a nM
Comments
extracted
Citation
 Farnaby, WFieldhouse, CHazel, KKerr, CKinsella, NLivermore, DMerchant, KMiller, D Pyridazinone compounds and their use as DAAO inhibitors US Patent  US9290456 Publication Date 3/22/2016 
Target
Name:
D-amino-acid oxidase
Synonyms:
D-amino-acid oxidase (DAAO) DAMOX OXDA_HUMAN
Type:
Homodimer
Mol. Mass.:
39476.06
Organism:
Homo sapiens (Human)
Description:
P14920
Residue:
347
  
Inhibitor
Name:
BDBM210789
Synonyms:
US10463663, Example 24 US9290456, 24 | US9931340, Example 24
Type:
Small organic molecule
Emp. Form.:
C13H13FN2O2
Mol. Mass.:
248.2529
SMILES:
Cc1cc(CCc2cc(O)c(=O)[nH]n2)ccc1F
: