Target
Serine/threonine-protein kinase pim-2
Ligand
BDBM119385
Substrate
Meas. Tech.
Pim Kinase Binding Activity
pH
7.2±n/a
Temperature
298.15±n/a K
Ki
2.49±n/a nM
Comments
extracted
Citation
 Wang, X Pyrazol-4-yl-heterocyclyl-carboxamide compounds and methods of use US Patent  US9573943 Publication Date 2/21/2017 
Target
Name:
Serine/threonine-protein kinase pim-2
Synonyms:
PIM2 Pim-2h Serine/threonine-protein kinase PIM | Serine/threonine-protein kinase pim-2 (PIM2)
Type:
Serine/threonine-protein kinase
Mol. Mass.:
34185.93
Organism:
Homo sapiens (Human)
Description:
Q9P1W9
Residue:
311
  
Inhibitor
Name:
BDBM119385
Synonyms:
US8669361, 112 | US9573943, Example 112
Type:
Small organic molecule
Emp. Form.:
C21H24FN7O
Mol. Mass.:
409.46
SMILES:
Cn1ncc(NC(=O)c2nc(ccc2N)-c2ccccc2F)c1N1CCC[C@@H](N)C1
: