Target
Serine/threonine-protein kinase pim-1
Ligand
BDBM119394
Substrate
Meas. Tech.
Pim Kinase Binding Activity
pH
7.2±n/a
Temperature
298.15±n/a K
Ki
137±n/a nM
Comments
extracted
Citation
 Wang, X Pyrazol-4-yl-heterocyclyl-carboxamide compounds and methods of use US Patent  US9573943 Publication Date 2/21/2017 
Target
Name:
Serine/threonine-protein kinase pim-1
Synonyms:
PIM-1 Kinase PIM1_HUMAN Serine/threonine-protein kinase (PIM1) Serine/threonine-protein kinase PIM1 | Serine/threonine-protein kinase pim-1 (PIM1)
Type:
Protein
Mol. Mass.:
35681.82
Organism:
Homo sapiens (Human)
Description:
P11309
Residue:
313
  
Inhibitor
Name:
BDBM119394
Synonyms:
US8669361, 123 | US9573943, Example 123
Type:
Small organic molecule
Emp. Form.:
C14H19ClN8O
Mol. Mass.:
350.807
SMILES:
Cn1ncc(NC(=O)c2nc(Cl)cnc2N)c1N1CCC[C@H](N)C1
: