Target
Serine/threonine-protein kinase pim-3
Ligand
BDBM119400
Substrate
Meas. Tech.
Pim Kinase Binding Activity
pH
7.2±n/a
Temperature
298.15±n/a K
Ki
0.245±n/a nM
Comments
extracted
Citation
 Wang, X Pyrazol-4-yl-heterocyclyl-carboxamide compounds and methods of use US Patent  US9573943 Publication Date 2/21/2017 
Target
Name:
Serine/threonine-protein kinase pim-3
Synonyms:
PIM3 Serine/threonine-protein kinase pim-3 (PIM3)
Type:
Protein
Mol. Mass.:
35888.19
Organism:
Homo sapiens (Human)
Description:
Q86V86
Residue:
326
  
Inhibitor
Name:
BDBM119400
Synonyms:
US8669361, 142 | US9573943, Example 142
Type:
Small organic molecule
Emp. Form.:
C22H26FN7O
Mol. Mass.:
423.4865
SMILES:
Cn1ncc(NC(=O)c2nc(ccc2N)-c2ccccc2F)c1N1CCC[C@H](N)CC1
: