Target
Carbonic anhydrase 2 [A65S,N67Q,E69T,I91L,F131V,K170E,L204A]
Ligand
BDBM210936
Substrate
Meas. Tech.
CA Inhibition Assay
Ki
20±0.0 nM
Citation
 Bhatt, AMahon, BPCruzeiro, VWCornelio, BLaronze-Cochard, MCeruso, MSapi, JRance, GAKhlobystov, ANFontana, ARoitberg, ASupuran, CTMcKenna, R Structure-Activity Relationships of Benzenesulfonamide-Based Inhibitors towards Carbonic Anhydrase Isoform Specificity. Chembiochem 18:213-222 (2017)  
Target
Name:
Carbonic anhydrase 2 [A65S,N67Q,E69T,I91L,F131V,K170E,L204A]
Synonyms:
CA2 Carbonic anhydrase 9 (CA IX)
Type:
Protein
Mol. Mass.:
29162.54
Organism:
Homo sapiens (Human)
Description:
Chimeric protein of CA II with 7 mutations (A65S, N67Q, E69T, I91L, F131V, K170E, L204A); 5sZ4, 5SZ5, 5SZ6, 5SZ7
Residue:
260
  
Inhibitor
Name:
BDBM210936
Synonyms:
4-(2-methylphenyl)-bezenesulfonamide (4b)
Type:
Small organic molecule
Emp. Form.:
C13H13NO2S
Mol. Mass.:
247.313
SMILES:
Cc1ccccc1-c1ccc(cc1)S(N)(=O)=O
: