Target
Heat shock protein HSP 90-alpha
Ligand
BDBM210943
Substrate
Meas. Tech.
Fluorescence Polarization (FP) Assay
pH
7.3±n/a
Kd
>1.00e+5±n/a nM
Comments
extracted
Citation
 Mishra, SJGhosh, SStothert, ARDickey, CABlagg, BS Transformation of the Non-Selective Aminocyclohexanol-Based Hsp90 Inhibitor into a Grp94-Seletive Scaffold. ACS Chem Biol 12:244-253 (2017)  
Target
Name:
Heat shock protein HSP 90-alpha
Synonyms:
HS90A_HUMAN HSP86 HSP90AA1 HSPCA Heat shock 86 kDa Heat shock protein HSP 90-alpha (HSP90) LAP-2 Lipopolysaccharide-associated protein 2 heat shock protein 90kDa alpha (cytosolic), class A member 1 isoform 2
Type:
Molecular Chaperone
Mol. Mass.:
84623.45
Organism:
Homo sapiens (Human)
Description:
P07900
Residue:
732
  
Inhibitor
Name:
BDBM210943
Synonyms:
4-(2-(2-chlorophenyl)-1H-pyrrol-1-yl)-2-(((1r,4r)-4-hydroxycyclohexyl)amino)benzamide (5e) | US10975030, Compound 5e
Type:
Small organic molecule
Emp. Form.:
C23H24ClN3O2
Mol. Mass.:
409.909
SMILES:
NC(=O)c1ccc(cc1NC1CCC(O)CC1)-n1cccc1-c1ccccc1Cl
: