Target
Endoplasmin
Ligand
BDBM210956
Substrate
Meas. Tech.
Fluorescence Polarization (FP) Assay
pH
7.3±n/a
Kd
8.35e+3± 1.4e+2 nM
Comments
extracted
Citation
 Mishra, SJGhosh, SStothert, ARDickey, CABlagg, BS Transformation of the Non-Selective Aminocyclohexanol-Based Hsp90 Inhibitor into a Grp94-Seletive Scaffold. ACS Chem Biol 12:244-253 (2017)  
Target
Name:
Endoplasmin
Synonyms:
94 kDa glucose-regulated protein GRP-94 Glucose regulated protein 94kDa (Grp94) Heat shock protein 90 kDa beta member 1 Tumor rejection antigen 1 | gp96 homolog
Type:
Protein
Mol. Mass.:
92417.36
Organism:
Homo sapiens (Human)
Description:
P14625
Residue:
803
  
Inhibitor
Name:
BDBM210956
Synonyms:
4-(2-(4-fluorobenzyl)-1H-pyrrol-1-yl)-2-(((1r,4r)-4-hydroxycyclohexyl)amino)benzamide (8g) | US10975030, Compound 8g
Type:
Small organic molecule
Emp. Form.:
C24H26FN3O2
Mol. Mass.:
407.4805
SMILES:
NC(=O)c1ccc(cc1NC1CCC(O)CC1)-n1cccc1Cc1ccc(F)cc1
: