Target
Taste receptor type 2 member 14
Ligand
BDBM211180
Substrate
Meas. Tech.
Fluorescence Polarization Assays
IC50
499.00±n/a nM
Citation
 Karanewsky, DSFotsing, JRTachdjian, CArellano, M Identification of human T2R receptors that respond to bitter compounds that elicit the bitter taste in compositions, and the use thereof in assays to identify compounds that inhibit (block) bitter taste in compositions and use thereof US Patent  US9247759 Publication Date 2/2/2016 
Target
Name:
Taste receptor type 2 member 14
Synonyms:
T2R14 TAS2R14 Taste receptor family B member 1
Type:
Mol. Mass.:
36183.39
Organism:
Homo sapiens (Human)
Description:
Q9NYV8
Residue:
317
  
Inhibitor
Name:
BDBM211180
Synonyms:
US9247759, 5-127
Type:
Small organic molecule
Emp. Form.:
C23H26N2O4S
Mol. Mass.:
426.529
SMILES:
Cc1ccc(cc1)S(=O)(=O)N(CC1CCC(CC1)C(O)=O)Cc1ccc(cc1)C#N
: