Target
Neutrophil elastase
Ligand
BDBM211464
Substrate
BDBM211682
Meas. Tech.
Human Neutrophil Elastase Assay
pH
7.5±n/a
Temperature
298.15±n/a K
IC50
<1±n/a nM
Comments
extracted
Citation
 Peters, SAnderskewitz, RMorschhaeuser, GOost, T Substituted dihydropyrimidinones and their use as inhibitors of neutrophil elastase activity US Patent  US9290457 Publication Date 3/22/2016 
Target
Name:
Neutrophil elastase
Synonyms:
Bone marrow serine protease Coagulation factor X ELANE Elastase HLE Leukocyte elastase Medullasin Neutrophil elastase (HNE) PMN elastase Trypsin
Type:
Enzyme
Mol. Mass.:
28532.38
Organism:
Homo sapiens (Human)
Description:
P08246
Residue:
267
  
Inhibitor
Name:
BDBM211464
Synonyms:
US9290457, Example 1.6
Type:
Small organic molecule
Emp. Form.:
C25H20F3N5O3
Mol. Mass.:
495.4532
SMILES:
CN1C(C(C(C)=O)=C(C)N(C1=O)c1cccc(c1)C(F)(F)F)c1ccc(cc1C(=O)NCC#N)C#N
:
Substrate
Name:
BDBM211682
Synonyms:
US9290457, MeOSuc-AAPV-AMC
Type:
Substrate
Emp. Form.:
C31H41N5O9
Mol. Mass.:
627.6853
SMILES:
COC(=O)CCC(=O)NC(C)C(=O)NC(C)C(=O)N1CCCC1C(=O)NC(C(C)C)C(=O)Nc1ccc2c(C)cc(=O)oc2c1
: