Target
Neutrophil elastase
Ligand
BDBM211842
Substrate
Meas. Tech.
Nuetrophil Elastase Acitivty Assay
pH
7.5±n/a
EC50
2±n/a nM
Comments
extracted
Citation
 Gnamm, COost, TPeters, SHoesch, HRies, UJ Substituted bicyclic dihydropyrimidinones and their use as inhibitors of neutrophil elastase activity US Patent  US9290459 Publication Date 3/22/2016 
Target
Name:
Neutrophil elastase
Synonyms:
Bone marrow serine protease Coagulation factor X ELANE Elastase HLE Leukocyte elastase Medullasin Neutrophil elastase (HNE) PMN elastase Trypsin
Type:
Enzyme
Mol. Mass.:
28532.38
Organism:
Homo sapiens (Human)
Description:
P08246
Residue:
267
  
Inhibitor
Name:
BDBM211842
Synonyms:
US9290459, 41.5 | US9670166, 41.5
Type:
Small organic molecule
Emp. Form.:
C26H21F3N4O4
Mol. Mass.:
510.4645
SMILES:
OCC1(CC1)NC(=O)N1C(C2=C(CCC2=O)N(C1=O)c1cccc(c1)C(F)(F)F)c1ccc(cc1)C#N
: