Target
Neutrophil elastase
Ligand
BDBM211757
Substrate
Meas. Tech.
Nuetrophil Elastase Acitivty Assay
pH
7.5±n/a
EC50
1±n/a nM
Comments
extracted
Citation
 Gnamm, COost, TPeters, SHoesch, HRies, UJ Substituted bicyclic dihydropyrimidinones and their use as inhibitors of neutrophil elastase activity US Patent  US9290459 Publication Date 3/22/2016 
Target
Name:
Neutrophil elastase
Synonyms:
Bone marrow serine protease Coagulation factor X ELANE Elastase HLE Leukocyte elastase Medullasin Neutrophil elastase (HNE) PMN elastase Trypsin
Type:
Enzyme
Mol. Mass.:
28532.38
Organism:
Homo sapiens (Human)
Description:
P08246
Residue:
267
  
Inhibitor
Name:
BDBM211757
Synonyms:
US9290459, 10A US9670166, 10A
Type:
Small organic molecule
Emp. Form.:
C22H16F3N3O4S
Mol. Mass.:
475.44
SMILES:
CS(=O)(=O)c1cc(ccc1[C@H]1NC(=O)N(C2=C1C(=O)CC2)c1cccc(c1)C(F)(F)F)C#N
: