Target
Neutrophil elastase
Ligand
BDBM211939
Substrate
Meas. Tech.
Nuetrophil Elastase Acitivty Assay
pH
7.5±n/a
EC50
<1±n/a nM
Comments
extracted
Citation
 Gnamm, COost, TPeters, SHoesch, HRies, UJ Substituted bicyclic dihydropyrimidinones and their use as inhibitors of neutrophil elastase activity US Patent  US9290459 Publication Date 3/22/2016 
Target
Name:
Neutrophil elastase
Synonyms:
Bone marrow serine protease Coagulation factor X ELANE Elastase HLE Leukocyte elastase Medullasin Neutrophil elastase (HNE) PMN elastase Trypsin
Type:
Enzyme
Mol. Mass.:
28532.38
Organism:
Homo sapiens (Human)
Description:
P08246
Residue:
267
  
Inhibitor
Name:
BDBM211939
Synonyms:
US9290459, 53.4 | US9670166, 53.4
Type:
Small organic molecule
Emp. Form.:
C26H24F2N4O5S
Mol. Mass.:
542.554
SMILES:
CC(C)NC(=O)N1C(C2=C(CCC2=O)N(C1=O)c1cccc(c1)C(F)F)c1ccc(cc1S(C)(=O)=O)C#N
: