Target
Cyclin-dependent kinase 2/G1/S-specific cyclin-E1
Ligand
BDBM5660
Substrate
GST-Rb fusion protein
Meas. Tech.
Kinase Inhibition assay
pH
8±n/a
Temperature
303.15±n/a K
IC50
5±n/a nM
Citation
 Misra, RNXiao, HYKim, KSLu, SHan, WCBarbosa, SAHunt, JTRawlins, DBShan, WAhmed, SZQian, LChen, BCZhao, RBednarz, MSKellar, KAMulheron, JGBatorsky, RRoongta, UKamath, AMarathe, PRanadive, SASack, JSTokarski, JSPavletich, NPLee, FYWebster, KRKimball, SD N-(cycloalkylamino)acyl-2-aminothiazole inhibitors of cyclin-dependent kinase 2. N-[5-[[[5-(1,1-dimethylethyl)-2-oxazolyl]methyl]thio]-2-thiazolyl]-4- piperidinecarboxamide (BMS-387032), a highly efficacious and selective antitumor agent. J Med Chem 47:1719-28 (2004)  
Target
Name:
Cyclin-dependent kinase 2/G1/S-specific cyclin-E1
Synonyms:
CDK2/CycE CDK2/E Cyclin-Dependent Kinase 2 (CDK2) Cyclin-dependent kinase 2/cyclin E1
Type:
Protein
Mol. Mass.:
Description:
Components:
This complex has 2 components.
Component 1
Name:
Cyclin-dependent kinase 2
Synonyms:
CDK2 CDK2_HUMAN Cell division protein kinase 2 Protein cereblon/Cyclin-dependent kinase 2 | p33 protein kinase
Type:
Enzyme Subunit
Mol. Mass.:
33938.17
Organism:
Homo sapiens (Human)
Description:
P24941
Residue:
298
  
Component 2
Name:
G1/S-specific cyclin-E1
Synonyms:
CCNE CCNE1_HUMAN
Type:
Enzyme Subunit
Mol. Mass.:
47073.17
Organism:
Homo sapiens (Human)
Description:
Residue:
410
  
Inhibitor
Name:
BDBM5660
Synonyms:
2-amino-5-thio-substituted thiazole 25 BMS-387032 analog 12 N-[5-[[(5-tert-Butyl-2-oxazolyl)methyl]thio]-2-thiazolyl]acetamide
Type:
Small organic molecule
Emp. Form.:
C13H17N3O2S2
Mol. Mass.:
311.423
SMILES:
CC(=O)Nc1ncc(SCc2ncc(o2)C(C)(C)C)s1
:
Substrate
Name:
GST-Rb fusion protein
Synonyms:
Glutathione S-transferase (GST)-retinoblastoma (Rb) fusion RB1 Rb | retinoblastoma
Type:
Other Protein Type
Mol. Mass.:
106410.17
Organism:
Homo sapiens (Human)
Description:
GST-60 kDa Rb fusion protein (comprising amino acids 378 to 928 of retinoblastoma)
Residue:
928