Target
Glycogen [starch] synthase, muscle
Ligand
BDBM212157
Substrate
Meas. Tech.
Glycogen Synthase Activity Assay
pH
7.3±n/a
Temperature
303.15±n/a K
EC50
250±n/a nM
Comments
extracted
Citation
 Nakagawa, TMatsumoto, KTakeshita, SYoshida, TTokumasu, MInoue, HKobayashi, K Pharmaceutical composition for treating diabetes US Patent  US9290487 Publication Date 3/22/2016 
Target
Name:
Glycogen [starch] synthase, muscle
Synonyms:
GYS GYS1_HUMAN Glycogen synthase (GYS1) | Muscle glycogen synthase
Type:
Enzyme
Mol. Mass.:
83779.52
Organism:
Homo sapiens (Human)
Description:
P13807
Residue:
737
  
Inhibitor
Name:
BDBM212157
Synonyms:
US9290487, compound of Ex. 4
Type:
Small organic molecule
Emp. Form.:
C26H23NO6
Mol. Mass.:
445.4639
SMILES:
OC(=O)[C@@H]1CCCN1C(=O)c1cccc(COc2ccc(cc2)-c2cccc3OCOc23)c1
: