Target
Dimer of Growth hormone secretagogue receptor type 1
Ligand
BDBM50049478
Substrate
Meas. Tech.
GHS Ligand Binding Assay
Ki
68.4±7.2 nM
Citation
 Mary, SFehrentz, JADamian, MGaibelet, GOrcel, HVerdié, PMouillac, BMartinez, JMarie, JBanères, JL Heterodimerization with Its splice variant blocks the ghrelin receptor 1a in a non-signaling conformation: a study with a purified heterodimer assembled into lipid discs. J Biol Chem 288:24656-65 (2013)  
Target
Name:
Dimer of Growth hormone secretagogue receptor type 1
Synonyms:
GHS-R1a:GHS-R1a
Type:
Dimeric receptor
Mol. Mass.:
Description:
Components:
This complex has 2 components.
Component 1
Name:
Growth hormone secretagogue receptor type 1
Synonyms:
GH-releasing peptide receptor GHS-R GHSR_HUMAN Ghrelin receptor | Ghrelin receptor 1a (GHS-R1a)
Type:
Receptor
Mol. Mass.:
41334.57
Organism:
Homo sapiens (Human)
Description:
Receptor binding studies use plasma membranes from LLC PK-1 cells transiently transfected with hGHSR1a.
Residue:
366
  
Component 2
Name:
Growth hormone secretagogue receptor type 1
Synonyms:
GH-releasing peptide receptor GHS-R GHSR_HUMAN Ghrelin receptor | Ghrelin receptor 1a (GHS-R1a)
Type:
Receptor
Mol. Mass.:
41334.57
Organism:
Homo sapiens (Human)
Description:
Receptor binding studies use plasma membranes from LLC PK-1 cells transiently transfected with hGHSR1a.
Residue:
366
  
Inhibitor
Name:
BDBM50049478
Synonyms:
1-{[(2R)-3-(benzyloxy)-1-{1-methanesulfonyl-1,2-dihydrospiro[indole-3,4'-piperidine]-1'-yl}-1-oxopropan-2-yl]carbamoyl}-1-methylethan-1-aminium 1N-[1-benzyloxymethyl-2-[1-methylsulfonylspiro[2,3-dihydro-1H-indole-3,4'-(hexahydropyridine)]-1-yl]-2-oxo-(1R)-ethyl]-2-amino-2-methylpropanamide [3a(MK-0677)] CHEMBL13817 MK-0677 | MK-677
Type:
Small organic molecule
Emp. Form.:
C27H36N4O5S
Mol. Mass.:
528.664
SMILES:
CC(C)(N)C(=O)N[C@H](COCc1ccccc1)C(=O)N1CCC2(CN(c3ccccc23)S(C)(=O)=O)CC1
: