Target
DNA (cytosine-5)-methyltransferase 3A [590-912]
Ligand
BDBM50384789
Substrate
Meas. Tech.
DNA Methylation Assay
pH
7.5±n/a
IC50
5.05e+4± 4.3e+3 nM
Comments
extracted
Citation
 Fagan, RLCryderman, DEKopelovich, LWallrath, LLBrenner, C Laccaic acid A is a direct, DNA-competitive inhibitor of DNA methyltransferase 1. J Biol Chem 288:23858-67 (2013)  
Target
Name:
DNA (cytosine-5)-methyltransferase 3A [590-912]
Synonyms:
DNA methyltransferase 3a (Dnmt3a) DNMT3A
Type:
Protein
Mol. Mass.:
37233.95
Organism:
Homo sapiens (Human)
Description:
Human Dnmt3a truncation (590-912 aa)
Residue:
323
  
Inhibitor
Name:
BDBM50384789
Synonyms:
CHEMBL2037378 | Laccaic acid A (LCA)
Type:
Small organic molecule
Emp. Form.:
C26H19NO12
Mol. Mass.:
537.4286
SMILES:
CC(=O)NCCc1ccc(O)c(c1)-c1c(O)c(O)c2C(=O)c3cc(O)c(C(O)=O)c(C(O)=O)c3C(=O)c2c1O
: