Target
Orphan methyltransferase M.SssI
Ligand
BDBM50384789
Substrate
Meas. Tech.
DNA Methylation Assay
pH
7.5±n/a
IC50
5.36e+4± 4.1e+3 nM
Comments
extracted
Citation
 Fagan, RLCryderman, DEKopelovich, LWallrath, LLBrenner, C Laccaic acid A is a direct, DNA-competitive inhibitor of DNA methyltransferase 1. J Biol Chem 288:23858-67 (2013)  
Target
Name:
Orphan methyltransferase M.SssI
Synonyms:
CpG DNA methylase MTSI_SPISQ sssIM
Type:
Protein
Mol. Mass.:
44323.75
Organism:
Spiroplasma monobiae strain MQ-1
Description:
P15840
Residue:
386
  
Inhibitor
Name:
BDBM50384789
Synonyms:
CHEMBL2037378 | Laccaic acid A (LCA)
Type:
Small organic molecule
Emp. Form.:
C26H19NO12
Mol. Mass.:
537.4286
SMILES:
CC(=O)NCCc1ccc(O)c(c1)-c1c(O)c(O)c2C(=O)c3cc(O)c(C(O)=O)c(C(O)=O)c3C(=O)c2c1O
: