Target
Cyclin-dependent kinase 2/G1/S-specific cyclin-E1
Ligand
BDBM5996
Substrate
GST-Rb fusion protein
Meas. Tech.
Kinase Inhibition assay
IC50
1800±n/a nM
Citation
 Markwalder, JAArnone, MRBenfield, PABoisclair, MBurton, CRChang, CHCox, SSCzerniak, PMDean, CLDoleniak, DGrafstrom, RHarrison, BAKaltenbach, RFNugiel, DARossi, KASherk, SRSisk, LMStouten, PTrainor, GLWorland, PSeitz, SP Synthesis and biological evaluation of 1-aryl-4,5-dihydro-1H-pyrazolo[3,4-d]pyrimidin-4-one inhibitors of cyclin-dependent kinases. J Med Chem 47:5894-911 (2004)  
Target
Name:
Cyclin-dependent kinase 2/G1/S-specific cyclin-E1
Synonyms:
CDK2/CycE CDK2/E Cyclin-Dependent Kinase 2 (CDK2) Cyclin-dependent kinase 2/cyclin E1
Type:
Protein
Mol. Mass.:
Description:
Components:
This complex has 2 components.
Component 1
Name:
Cyclin-dependent kinase 2
Synonyms:
CDK2 CDK2_HUMAN Cell division protein kinase 2 Protein cereblon/Cyclin-dependent kinase 2 | p33 protein kinase
Type:
Enzyme Subunit
Mol. Mass.:
33938.17
Organism:
Homo sapiens (Human)
Description:
P24941
Residue:
298
  
Component 2
Name:
G1/S-specific cyclin-E1
Synonyms:
CCNE CCNE1_HUMAN
Type:
Enzyme Subunit
Mol. Mass.:
47073.17
Organism:
Homo sapiens (Human)
Description:
Residue:
410
  
Inhibitor
Name:
BDBM5996
Synonyms:
3-Ethyl-6-(2-phenylethyl)-1-(2,4,6-trichlorophenyl)-4,5-dihydro-1H-pyrazolo[3,4-d]pyrimidin-4-one pyrazolo[3,4-d]pyrimidin-4-one deriv. 18g
Type:
Small organic molecule
Emp. Form.:
C21H17Cl3N4O
Mol. Mass.:
447.745
SMILES:
CCc1nn(-c2c(Cl)cc(Cl)cc2Cl)c2nc(CCc3ccccc3)[nH]c(=O)c12
:
Substrate
Name:
GST-Rb fusion protein
Synonyms:
Glutathione S-transferase (GST)-retinoblastoma (Rb) fusion RB1 Rb | retinoblastoma
Type:
Other Protein Type
Mol. Mass.:
106410.17
Organism:
Homo sapiens (Human)
Description:
GST-60 kDa Rb fusion protein (comprising amino acids 378 to 928 of retinoblastoma)
Residue:
928