Target
Cyclin-dependent kinase/G2/mitotic-specific cyclin- 1
Ligand
BDBM6028
Substrate
GST-Rb fusion protein
Meas. Tech.
Kinase Inhibition assay
IC50
180±n/a nM
Citation
 Markwalder, JAArnone, MRBenfield, PABoisclair, MBurton, CRChang, CHCox, SSCzerniak, PMDean, CLDoleniak, DGrafstrom, RHarrison, BAKaltenbach, RFNugiel, DARossi, KASherk, SRSisk, LMStouten, PTrainor, GLWorland, PSeitz, SP Synthesis and biological evaluation of 1-aryl-4,5-dihydro-1H-pyrazolo[3,4-d]pyrimidin-4-one inhibitors of cyclin-dependent kinases. J Med Chem 47:5894-911 (2004)  
Target
Name:
Cyclin-dependent kinase/G2/mitotic-specific cyclin- 1
Synonyms:
CDK1/B CDK1/CyclinB Cyclin-Dependent Kinase 1 (CDK1) Cyclin-dependent kinase/G2/mitotic-specific cyclin 1 | cdk1
Type:
Protein Complex
Mol. Mass.:
Description:
CDK1/Cyclin B complexes were purified from insect cells co-infected with baculovirus vectors containing each of the components.
Components:
This complex has 2 components.
Component 1
Name:
Cyclin-dependent kinase 1
Synonyms:
CDC2 CDK1 CDKN1 Cell division protein kinase 1 P34CDC2 | p34 protein kinase
Type:
Enzyme Subunit
Mol. Mass.:
34101.08
Organism:
Homo sapiens (Human)
Description:
P06493
Residue:
297
  
Component 2
Name:
G2/mitotic-specific cyclin-B1
Synonyms:
CCNB CCNB1_HUMAN
Type:
Enzyme Subunit
Mol. Mass.:
48340.95
Organism:
Homo sapiens (Human)
Description:
P14635
Residue:
433
  
Inhibitor
Name:
BDBM6028
Synonyms:
2-(tert-Butoxycarbonylamino)-N-(4-{[3-ethyl-4-oxo-1-(2,4,6-trichlorophenyl)-4,5-dihydro-1H-pyrazolo[3,4-d]-pyrimidin-6-yl]methyl}phenyl)acetamide tert-butyl N-{[(4-{[3-ethyl-4-oxo-1-(2,4,6-trichlorophenyl)-1H,4H,5H-pyrazolo[3,4-d]pyrimidin-6-yl]methyl}phenyl)carbamoyl]methyl}carbamate
Type:
Small organic molecule
Emp. Form.:
C27H27Cl3N6O4
Mol. Mass.:
605.9
SMILES:
CCc1nn(-c2c(Cl)cc(Cl)cc2Cl)c2nc(Cc3ccc(NC(=O)CNC(=O)OC(C)(C)C)cc3)[nH]c(=O)c12
:
Substrate
Name:
GST-Rb fusion protein
Synonyms:
Glutathione S-transferase (GST)-retinoblastoma (Rb) fusion RB1 Rb | retinoblastoma
Type:
Other Protein Type
Mol. Mass.:
106410.17
Organism:
Homo sapiens (Human)
Description:
GST-60 kDa Rb fusion protein (comprising amino acids 378 to 928 of retinoblastoma)
Residue:
928