Target
Leukotriene A-4 hydrolase
Ligand
BDBM289875
Substrate
Meas. Tech.
Enzymatic Assay
pH
7.5±n/a
Temperature
298.15±n/a K
IC50
0.750±n/a nM
Comments
extracted
Citation
 Abeywardane, ABroadwater, JBrunette, SRKirrane, Jr., TMRazavi, HSibley, RSmith Keenan, LLZhang, Q Inhibitors of leukotriene production US Patent  US9573957 Publication Date 2/21/2017 
Target
Name:
Leukotriene A-4 hydrolase
Synonyms:
LKHA4_HUMAN LTA4 Leukotriene A(4) hydrolase Leukotriene A4 hydrolase
Type:
Hydrolase; metalloprotease
Mol. Mass.:
69280.41
Organism:
Homo sapiens (Human)
Description:
Human recombinant LTA4H.
Residue:
611
  
Inhibitor
Name:
BDBM289875
Synonyms:
(1-{6-[5-(2H-Pyrazol-3-yl)-pyridin- 2-yloxy]-naphthalen-2-ylmethyl}- piperidin-4-yl)-methanol | US9573957, Example 17
Type:
Small organic molecule
Emp. Form.:
C25H26N4O2
Mol. Mass.:
414.4995
SMILES:
OCC1CCN(Cc2ccc3cc(Oc4ccc(cn4)-c4ccn[nH]4)ccc3c2)CC1
: