Target
Leukotriene A-4 hydrolase
Ligand
BDBM289932
Substrate
Meas. Tech.
Enzymatic Assay
pH
7.5±n/a
Temperature
298.15±n/a K
IC50
0.470±n/a nM
Comments
extracted
Citation
 Abeywardane, ABroadwater, JBrunette, SRKirrane, Jr., TMRazavi, HSibley, RSmith Keenan, LLZhang, Q Inhibitors of leukotriene production US Patent  US9573957 Publication Date 2/21/2017 
Target
Name:
Leukotriene A-4 hydrolase
Synonyms:
LKHA4_HUMAN LTA4 Leukotriene A(4) hydrolase Leukotriene A4 hydrolase
Type:
Hydrolase; metalloprotease
Mol. Mass.:
69280.41
Organism:
Homo sapiens (Human)
Description:
Human recombinant LTA4H.
Residue:
611
  
Inhibitor
Name:
BDBM289932
Synonyms:
1-[1-(2-{6-[5-(2H-Pyrazol-3-yl)- pyridin-2-yloxy]-benzofuran-3-yl}- ethyl)-piperidin-4-yl]-pyrrolidin- 2-one | US9573957, Example 72
Type:
Small organic molecule
Emp. Form.:
C27H29N5O3
Mol. Mass.:
471.5509
SMILES:
O=C1CCCN1C1CCN(CCc2coc3cc(Oc4ccc(cn4)-c4ccn[nH]4)ccc23)CC1
: