Target
Leukotriene A-4 hydrolase
Ligand
BDBM289987
Substrate
Meas. Tech.
Enzymatic Assay
pH
7.5±n/a
Temperature
298.15±n/a K
IC50
0.420±n/a nM
Comments
extracted
Citation
 Abeywardane, ABroadwater, JBrunette, SRKirrane, Jr., TMRazavi, HSibley, RSmith Keenan, LLZhang, Q Inhibitors of leukotriene production US Patent  US9573957 Publication Date 2/21/2017 
Target
Name:
Leukotriene A-4 hydrolase
Synonyms:
LKHA4_HUMAN LTA4 Leukotriene A(4) hydrolase Leukotriene A4 hydrolase
Type:
Hydrolase; metalloprotease
Mol. Mass.:
69280.41
Organism:
Homo sapiens (Human)
Description:
Human recombinant LTA4H.
Residue:
611
  
Inhibitor
Name:
BDBM289987
Synonyms:
2-Hydroxy-N-methyl-N-((R)-1-{6- [5-(2H-pyrazol-3-yl)-pyridin-2- yloxy]-benzofuran-3-ylmethyl}- pyrrolidin-3-yl)-acetamide | US9573957, Example 113
Type:
Small organic molecule
Emp. Form.:
C24H25N5O4
Mol. Mass.:
447.4864
SMILES:
CN([C@@H]1CCN(Cc2coc3cc(Oc4ccc(cn4)-c4ccn[nH]4)ccc23)C1)C(=O)CO
: