Target
Leukotriene A-4 hydrolase
Ligand
BDBM289995
Substrate
Meas. Tech.
Enzymatic Assay
pH
7.5±n/a
Temperature
298.15±n/a K
IC50
4.90±n/a nM
Comments
extracted
Citation
 Abeywardane, ABroadwater, JBrunette, SRKirrane, Jr., TMRazavi, HSibley, RSmith Keenan, LLZhang, Q Inhibitors of leukotriene production US Patent  US9573957 Publication Date 2/21/2017 
Target
Name:
Leukotriene A-4 hydrolase
Synonyms:
LKHA4_HUMAN LTA4 Leukotriene A(4) hydrolase Leukotriene A4 hydrolase
Type:
Hydrolase; metalloprotease
Mol. Mass.:
69280.41
Organism:
Homo sapiens (Human)
Description:
Human recombinant LTA4H.
Residue:
611
  
Inhibitor
Name:
BDBM289995
Synonyms:
(R)-3-Hydroxy-1-(4-{6-[5-(2H-pyrazol- 3-yl)-pyridin-2-yloxy]-quinolin-2- ylmethyl}-piperazin-1-yl)-butan- 1-one | US9573957, Example 121
Type:
Small organic molecule
Emp. Form.:
C26H28N6O3
Mol. Mass.:
472.5389
SMILES:
C[C@@H](O)CC(=O)N1CCN(Cc2ccc3cc(Oc4ccc(cn4)-c4ccn[nH]4)ccc3n2)CC1
: