Target
Histone deacetylase 6
Ligand
BDBM213183
Substrate
Meas. Tech.
HDAC Enzyme Assay
pH
7.4±n/a
Temperature
298.15±n/a K
IC50
13±n/a nM
Comments
extracted
Citation
 van Duzer, JHMazitschek, RJones, SSYang, MTamang, DL Pyrimidine hydroxy amide compounds as histone deacetylase inhibitors US Patent  US9278963 Publication Date 3/8/2016 
Target
Name:
Histone deacetylase 6
Synonyms:
Cereblon/Histone deacetylase 6 HDAC6 Histone deacetylase 6 (HDAC6) KIAA0901 | ORF Names:JM21
Type:
Chromatin regulator; hydrolase; repressor
Mol. Mass.:
131381.51
Organism:
Homo sapiens (Human)
Description:
Q9UBN7
Residue:
1215
  
Inhibitor
Name:
BDBM213183
Synonyms:
US9278963, 025
Type:
Small organic molecule
Emp. Form.:
C27H31N5O3
Mol. Mass.:
473.5667
SMILES:
CC(C)[C@@H](C(=O)N1CCC(CC1)(Nc1ncc(cn1)C(=O)NO)c1ccccc1)c1ccccc1
: