Target
C-terminal-binding protein 1 [A52D]
Ligand
BDBM213227
Substrate
Meas. Tech.
Equilibrium Dialysis
Kd
5e+2±n/a nM
Citation
 Madison, DLWirz, JASiess, DLundblad, JR Nicotinamide adenine dinucleotide-induced multimerization of the co-repressor CtBP1 relies on a switching tryptophan. J Biol Chem 288:27836-48 (2013)  
Target
Name:
C-terminal-binding protein 1 [A52D]
Synonyms:
C-terminal binding protein (CtBP1 A52D) CTBP1 | CTBP1_HUMAN
Type:
Protein
Mol. Mass.:
47580.80
Organism:
Homo sapiens (Human)
Description:
Human CtBP1 A52D mutant
Residue:
440
  
Inhibitor
Name:
BDBM213227
Synonyms:
Nicotinamide adenine dinucleotide (NAD)
Type:
Small organic molecule
Emp. Form.:
C21H27N7O14P2
Mol. Mass.:
663.4251
SMILES:
NC(=O)c1ccc[n+](c1)[C@@H]1O[C@H](COP([O-])(=O)OP(O)(=O)OC[C@H]2O[C@H]([C@H](O)[C@@H]2O)n2cnc3c(N)ncnc23)[C@@H](O)[C@H]1O
: