Target
Histone deacetylase 3
Ligand
BDBM19149
Substrate
Meas. Tech.
Enzymatic HDAC Activity Assay
pH
7.5±n/a
IC50
18.6±n/a nM
Comments
extracted
Citation
 Lauffer, BEMintzer, RFong, RMukund, STam, CZilberleyb, IFlicke, BRitscher, AFedorowicz, GVallero, ROrtwine, DFGunzner, JModrusan, ZNeumann, LKoth, CMLupardus, PJKaminker, JSHeise, CESteiner, P Histone deacetylase (HDAC) inhibitor kinetic rate constants correlate with cellular histone acetylation but not transcription and cell viability. J Biol Chem 288:26926-43 (2013)  
Target
Name:
Histone deacetylase 3
Synonyms:
HD3 HDAC3_HUMAN Human HDAC3 SMAP45
Type:
Enzyme
Mol. Mass.:
48829.55
Organism:
Homo sapiens (Human)
Description:
O15379
Residue:
428
  
Inhibitor
Name:
BDBM19149
Synonyms:
CHEMBL98 SAHA US10188756, Compound SAHA US11505523, Compound SAHA US9353061, SAHA US9695181, Vorinostat Zolinza suberoylanilide hydroxamic acid
Type:
Small organic molecule
Emp. Form.:
C14H20N2O3
Mol. Mass.:
264.3202
SMILES:
ONC(=O)CCCCCCC(=O)Nc1ccccc1
: