Target
Histone deacetylase 4
Ligand
BDBM50276074
Substrate
Meas. Tech.
Enzymatic HDAC Activity Assay
pH
7.5±n/a
IC50
>1.0e+4±n/a nM
Comments
extracted
Citation
 Lauffer, BEMintzer, RFong, RMukund, STam, CZilberleyb, IFlicke, BRitscher, AFedorowicz, GVallero, ROrtwine, DFGunzner, JModrusan, ZNeumann, LKoth, CMLupardus, PJKaminker, JSHeise, CESteiner, P Histone deacetylase (HDAC) inhibitor kinetic rate constants correlate with cellular histone acetylation but not transcription and cell viability. J Biol Chem 288:26926-43 (2013)  
Target
Name:
Histone deacetylase 4
Synonyms:
Cereblon/Histone deacetylase 4 HDAC4 Histone acetylase 4(HDAC4) KIAA0288
Type:
Enzyme
Mol. Mass.:
119049.39
Organism:
Homo sapiens (Human)
Description:
P56524
Residue:
1084
  
Inhibitor
Name:
BDBM50276074
Synonyms:
CHEMBL470791 N-(2-amino-5-(thiophen-2-yl)phenyl)-6-(1-oxo-2,7-diazaspiro[3.5]nonan-7-yl)nicotinamide
Type:
Small organic molecule
Emp. Form.:
C23H23N5O2S
Mol. Mass.:
433.526
SMILES:
Nc1ccc(cc1NC(=O)c1ccc(nc1)N1CCC2(CNC2=O)CC1)-c1cccs1
: