Target
ATP-sensitive inward rectifier potassium channel 1
Ligand
BDBM290046
Substrate
Meas. Tech.
Electrophysiology Assay
pH
7.4±n/a
IC50
570±n/a nM
Comments
extracted
Citation
 Pasternak, ADeJesus, RKFrie, JLPio, BTang, HWalsh, SP Inhibitors of the renal outer medullary potassium channel US Patent  US9573961 Publication Date 2/21/2017 
Target
Name:
ATP-sensitive inward rectifier potassium channel 1
Synonyms:
ATP-regulated potassium channel ROM-K ATP-sensitive inward rectifier potassium channel 1 KCNJ1 Potassium channel (ATP modulatory) ROMK1 The Renal Outer Medullary Potassium (ROMK)
Type:
Enzyme Catalytic Domain
Mol. Mass.:
44809.08
Organism:
Homo sapiens (Human)
Description:
gi_223460826
Residue:
391
  
Inhibitor
Name:
BDBM290046
Synonyms:
US9573961, Example 31
Type:
Small organic molecule
Emp. Form.:
C26H26FN3O5
Mol. Mass.:
479.5001
SMILES:
COc1cc(CC(=O)N2CCN3C[C@@H](OC[C@H]3C2)c2ccc3C(=O)OCCc3c2)c(F)cc1C#N
: