Target
ATP-sensitive inward rectifier potassium channel 1
Ligand
BDBM290090
Substrate
Meas. Tech.
Electrophysiology Assay
pH
7.4±n/a
IC50
210±n/a nM
Comments
extracted
Citation
 Pasternak, ADeJesus, RKFrie, JLPio, BTang, HWalsh, SP Inhibitors of the renal outer medullary potassium channel US Patent  US9573961 Publication Date 2/21/2017 
Target
Name:
ATP-sensitive inward rectifier potassium channel 1
Synonyms:
ATP-regulated potassium channel ROM-K ATP-sensitive inward rectifier potassium channel 1 KCNJ1 Potassium channel (ATP modulatory) ROMK1 The Renal Outer Medullary Potassium (ROMK)
Type:
Enzyme Catalytic Domain
Mol. Mass.:
44809.08
Organism:
Homo sapiens (Human)
Description:
gi_223460826
Residue:
391
  
Inhibitor
Name:
BDBM290090
Synonyms:
US9573961, Example 75
Type:
Small organic molecule
Emp. Form.:
C23H24N8O3
Mol. Mass.:
460.4885
SMILES:
Cc1c(ccc2nonc12)[C@H]1CN2CCN(C[C@H]2CO1)C(=O)Cc1ccc(cc1)-n1cnnn1
: