Target
Beta-secretase 2
Ligand
BDBM213717
Substrate
Meas. Tech.
BACE-2 Inhibition Assay
pH
4.5±n/a
Temperature
298.15±n/a K
IC50
11±n/a nM
Comments
extracted
Citation
 Hurth, KJacquier, SMachauer, RRueeger, HTintelnot-Blomley, MVeenstra, SJVoegtle, M Oxazine derivatives and their use in the treatment of disease US Patent  US9284284 Publication Date 3/15/2016 
Target
Name:
Beta-secretase 2
Synonyms:
AEPLC ASP1 Asp 1 Aspartyl protease 1 BACE2_HUMAN Beta-secretase (BACE) Beta-secretase 2 (BACE-2) Beta-site APP-cleaving enzyme 2 Memapsin-1 beta-Secretase (BACE-2)
Type:
Protein
Mol. Mass.:
56171.20
Organism:
Homo sapiens (Human)
Description:
Q9Y5Z0
Residue:
518
  
Inhibitor
Name:
BDBM213717
Synonyms:
US9284284, 8
Type:
Small organic molecule
Emp. Form.:
C19H15BrF3N5O
Mol. Mass.:
466.255
SMILES:
NC1=N[C@](COC1)(C(F)F)c1cc(Nc2nccc3cc(Br)cnc23)ccc1F
: