Target
Catenin beta-1 [138-686]
Ligand
BDBM213749
Substrate
Meas. Tech.
Fluorescence Polarization (FP) Assay
Temperature
298.15±n/a K
Ki
80340±4170 nM
Comments
extracted
Citation
 Ji, HYu, BZhang, MGuo, W Substituted 1H-indazol-1-ol analogs as inhibitors of beta catenin/Tcf protein-protein interactions US Patent  US9284299 Publication Date 3/15/2016 
Target
Name:
Catenin beta-1 [138-686]
Synonyms:
Beta-catenin CTNNB | CTNNB1
Type:
Protein
Mol. Mass.:
60127.24
Organism:
Homo sapiens (Human)
Description:
aa 138-686
Residue:
549
  
Inhibitor
Name:
BDBM213749
Synonyms:
US9284299, iCRT5 | US9738628, Compound iCRT5
Type:
Small organic molecule
Emp. Form.:
C16H17NO5S2
Mol. Mass.:
367.44
SMILES:
COc1ccc(\C=C2/SC(=S)N(CCCC(O)=O)C2=O)cc1OC
: