Target
Catenin beta-1 [138-686]
Ligand
BDBM213766
Substrate
Meas. Tech.
Fluorescence Polarization (FP) Assay
Temperature
298.15±n/a K
Ki
3380±610 nM
Comments
extracted
Citation
 Ji, HYu, BZhang, MGuo, W Substituted 1H-indazol-1-ol analogs as inhibitors of beta catenin/Tcf protein-protein interactions US Patent  US9284299 Publication Date 3/15/2016 
Target
Name:
Catenin beta-1 [138-686]
Synonyms:
Beta-catenin CTNNB | CTNNB1
Type:
Protein
Mol. Mass.:
60127.24
Organism:
Homo sapiens (Human)
Description:
aa 138-686
Residue:
549
  
Inhibitor
Name:
BDBM213766
Synonyms:
US9284299, 17
Type:
Small organic molecule
Emp. Form.:
C9H9N7O
Mol. Mass.:
231.2141
SMILES:
On1ncc2cc(NCc3nn[nH]n3)ccc12
: