Target
Catenin beta-1 [138-686]
Ligand
BDBM213769
Substrate
Meas. Tech.
Fluorescence Polarization (FP) Assay
Temperature
298.15±n/a K
Ki
33140±2970 nM
Comments
extracted
Citation
 Ji, HYu, BZhang, MGuo, W Substituted 1H-indazol-1-ol analogs as inhibitors of beta catenin/Tcf protein-protein interactions US Patent  US9284299 Publication Date 3/15/2016 
Target
Name:
Catenin beta-1 [138-686]
Synonyms:
Beta-catenin CTNNB | CTNNB1
Type:
Protein
Mol. Mass.:
60127.24
Organism:
Homo sapiens (Human)
Description:
aa 138-686
Residue:
549
  
Inhibitor
Name:
BDBM213769
Synonyms:
US9284299, 20 | US9738628, Compound 20
Type:
Small organic molecule
Emp. Form.:
C16H12ClN7O2
Mol. Mass.:
369.765
SMILES:
On1ncc2cc(ccc12)N(Cc1nn[nH]n1)C(=O)c1cccc(Cl)c1
: