Target
Catenin beta-1 [138-686]
Ligand
BDBM213763
Substrate
Meas. Tech.
AlphaScreen Assay
pH
7.4±n/a
Temperature
298.15±n/a K
Ki
70370±1820 nM
Comments
extracted
Citation
 Ji, HYu, BZhang, MGuo, W Substituted 1H-indazol-1-ol analogs as inhibitors of beta catenin/Tcf protein-protein interactions US Patent  US9284299 Publication Date 3/15/2016 
Target
Name:
Catenin beta-1 [138-686]
Synonyms:
Beta-catenin CTNNB | CTNNB1
Type:
Protein
Mol. Mass.:
60127.24
Organism:
Homo sapiens (Human)
Description:
aa 138-686
Residue:
549
  
Inhibitor
Name:
BDBM213763
Synonyms:
US9284299, 14
Type:
Small organic molecule
Emp. Form.:
C11H10N4O2S
Mol. Mass.:
262.288
SMILES:
On1ncc2cc(CCc3noc(=S)[nH]3)ccc12
: