Target
Cadherin-1 [819-873]/Catenin beta-1 [138-686]
Ligand
BDBM213748
Substrate
Meas. Tech.
Fluorescence Polarization (FP) Assay
Temperature
298.15±n/a K
Ki
13040±310 nM
Comments
extracted
Citation
 Ji, HYu, BZhang, MGuo, W Substituted 1H-indazol-1-ol analogs as inhibitors of beta catenin/Tcf protein-protein interactions US Patent  US9284299 Publication Date 3/15/2016 
Target
Name:
Cadherin-1 [819-873]/Catenin beta-1 [138-686]
Synonyms:
Beta-catenin/E-cadherin
Type:
Enzyme
Mol. Mass.:
Description:
Components:
This complex has 2 components.
Component 1
Name:
Catenin beta-1 [138-686]
Synonyms:
Beta-catenin CTNNB | CTNNB1
Type:
Protein
Mol. Mass.:
60127.24
Organism:
Homo sapiens (Human)
Description:
aa 138-686
Residue:
549
  
Component 2
Name:
Cadherin-1 [819-873]
Synonyms:
CADH1_HUMAN CDHE UVO
Type:
Enzyme
Mol. Mass.:
6102.29
Organism:
Homo sapiens (Human)
Description:
Human E-cadherin truncation (819-873 aa)
Residue:
55
  
Inhibitor
Name:
BDBM213748
Synonyms:
US9284299, PKF115-584 | US9738628, Compound PKF115-584
Type:
Small organic molecule
Emp. Form.:
C44H38O14
Mol. Mass.:
790.7641
SMILES:
COc1cc(O)c2c3c1c1c(OC)cc(O)c4c1c(c(C[C@@H](C)OC(=O)c1ccccc1)c(OC)c4=O)c3c(C[C@@H](C)OC(=O)Oc1ccc(O)cc1)c(OC)c2=O
: