Target
Muscarinic acetylcholine receptor M3
Ligand
BDBM103784
Substrate
Meas. Tech.
Radioligand Binding Assay
Ki
0.200±n/a nM
Citation
 Hughes, ADByun, DChen, YFleury, MJacobsen, JRStangeland, ELWilson, RDYen, R Diamide compounds having muscarinic receptor antagonist and β2 adrenergic receptor agonist activity US Patent  US9572802 Publication Date 2/21/2017 
Target
Name:
Muscarinic acetylcholine receptor M3
Synonyms:
ACM3_HUMAN Cholinergic, muscarinic M3 Muscarinic receptor M3 | RecName: Full=Muscarinic acetylcholine receptor M3
Type:
Enzyme
Mol. Mass.:
66151.03
Organism:
Homo sapiens (Human)
Description:
P20309
Residue:
590
  
Inhibitor
Name:
BDBM103784
Synonyms:
US8551978, I-54 US9394275, I-54 US9682957, I-54
Type:
Small organic molecule
Emp. Form.:
C51H56N6O8
Mol. Mass.:
881.0257
SMILES:
COc1ccc(CC(=O)Nc2cccc(c2)N(C)C(=O)CCN2CCC(CC2)OC(=O)Nc2ccccc2-c2ccccc2)cc1CC(C)NC[C@H](O)c1ccc(O)c2[nH]c(=O)ccc12
: