Target
Muscarinic acetylcholine receptor M3
Ligand
BDBM290220
Substrate
Meas. Tech.
Radioligand Binding Assay
Ki
0.100±n/a nM
Citation
 Hughes, ADByun, DChen, YFleury, MJacobsen, JRStangeland, ELWilson, RDYen, R Diamide compounds having muscarinic receptor antagonist and β2 adrenergic receptor agonist activity US Patent  US9572802 Publication Date 2/21/2017 
Target
Name:
Muscarinic acetylcholine receptor M3
Synonyms:
ACM3_HUMAN Cholinergic, muscarinic M3 Muscarinic receptor M3 | RecName: Full=Muscarinic acetylcholine receptor M3
Type:
Enzyme
Mol. Mass.:
66151.03
Organism:
Homo sapiens (Human)
Description:
P20309
Residue:
590
  
Inhibitor
Name:
BDBM290220
Synonyms:
US9572802, Compound I-96
Type:
Small organic molecule
Emp. Form.:
C49H52N6O7
Mol. Mass.:
836.9732
SMILES:
CN(C(=O)CCN1CCC(CC1)OC(=O)Nc1ccccc1-c1ccccc1)c1cccc(CNC(=O)Cc2cccc(CNC[C@H](O)c3ccc(O)c4[nH]c(=O)ccc34)c2)c1
: