Target
Isoform Tau-F of Microtubule-associated protein tau
Ligand
BDBM214724
Substrate
Meas. Tech.
Tau Protein Assay
pH
7.4±n/a
IC50
2.57e+3± 1.06e+3 nM
Comments
extracted
Citation
 Schafer, KNCisek, KHuseby, CJChang, EKuret, J Structural determinants of Tau aggregation inhibitor potency. J Biol Chem 288:32599-611 (2013)  
Target
Name:
Isoform Tau-F of Microtubule-associated protein tau
Synonyms:
MAPT MTBT1 Microtubule-associated protein Tau isoform 2N4R (Tau 2N4R) TAU | TAU_HUMAN
Type:
Enzyme Catalytic Domain
Mol. Mass.:
45857.42
Organism:
Homo sapiens (Human)
Description:
P10636-8
Residue:
441
  
Inhibitor
Name:
BDBM214724
Synonyms:
Cyanines, 6
Type:
Small organic molecule
Emp. Form.:
C29H37N2
Mol. Mass.:
413.6169
SMILES:
CCCN1\C(=C\C=C\C2=[N+](CCC)c3ccccc3C2(C)C)C(C)(C)c2ccccc12
: